datetime,discomfort,hints,sleep_deficit_8hr,sore_throat,headache,stress,caffine,sugar,salt,dh_left,dh_right,accel_ul,accel_dr,accel_ur,accel_dl,h_loss_l,h_loss_r,notes
2020-05-11 9:20:00,0.5,0,,,0,,,,,,,,,,,0,0,""
2020-05-11 12:00:00,0.5,0,,,0,,,,,,,,,,,0,0,""
2020-05-11 17:00:00,0.5,0,,,0,,,,,,,,,,,0,0,""
2020-05-12 08:00:00,0.5,0,,,0,,,,,,,,,,,0,0,""
2020-05-14 08:00:00,0.5,0,,,0,,,,,,,,,,,0,0,""
2020-05-19 19:00:00,2,0,,,0,,,,,,,,,,,0,0,""
2020-05-20 07:30:00,3,0,,,0,,,,,,,,,,,0,0,""
2020-05-21 07:30:00,3,0,,,0,,,,,,,,,,,1,0,""
2020-05-23 09:00:00,2,0,,,0,,,,,,,,,,,7,0,""
2020-05-24 09:00:00,,,,,,,,,,,,,,,,,,""
2020-07-15 09:00:00,0.0,,,,,,,,,,,,,,,,,""
2020-07-16 09:00:00,0.0,,,,,5,2,,,,,,,,,,,""
2020-07-17 09:00:00,0.0,,,,,,,,,,,,,,,,,""
2020-07-18 09:00:00,0.5,,,,,,,,,,,,,,,,,""
2020-07-19 09:00:00,0.5,,,,,,,,,,,,,,,,,""
2020-07-20 06:30:00,1.0,,3,,,8,1.5,,,5,,,,,,,,""
2020-07-21 06:30:00,2.0,,1,,,5,1.5,,,5,,,,,,,,""
2020-07-22 06:30:00,2.0,,1,,,5,1.5,,,5,,,,,,,,""
2020-07-23 06:30:00,2.0,,1,,,5,1.5,,,5,,,,,,,,""
2020-07-24 06:30:00,2.0,,1,,,5,1.5,,,5,,,,,,5,,""
2020-07-25 06:30:00,3.0,,,,,1,,,,5,,,,,,5,,"Constant horizontal nystagmus"
2020-07-25 06:30:00,2.0,,0.5,,,1,0,,,,,,,,,5,,""
2020-07-26 06:30:00,2.0,,0.0,,,5,0,,,,,,,,,5,,""
2020-07-26 21:00:00,1.0,,0.5,,,5,0,,,,,,,,,,,""
2020-08-09 21:00:00,0.5,,0.5,,,5,0,,,,,,,,,5,,""
2020-08-09 22:00:00,,,,,,,,,,,,,,,,,,""
2020-11-14 7:00:00,1.0,1,1,,,1,,,,,,,,,,,,""
2020-11-30 7:00:00,1.0,,1,,3,1,,,,,,,,,,,,""
2020-12-11 7:00:00,2.0,,1,,,1,,,,,,,,,,,,""
2020-12-12 7:00:00,2.0,,0.5,,,1,,,,,,,,,,,,""
2020-12-13 7:00:00,2.5,,,,,1,,,,,,,,,,,,""
2020-12-14 7:00:00,3.0,,1,,,,,,,4,4,,,,,,,""
2020-12-18 7:00:00,2.0,,1.5,,,,,,,1,4,,,,,,3,""
2020-12-18 12:00:00,1.0,,1.5,,,,,,,,,,,,,,,""
2020-12-18 9:00:00,0.0,,1.5,,,5,,,,,,,,,,,,""
2020-12-19 9:00:00,0.0,,1.5,,,,,,,,,,,,,,3,""
2020-12-20 9:00:00,,,,,,,,,,,,,,,,,,""
2020-12-21 9:00:00,0.0,,1.5,,,,,,,,,,,,,,2,""
2020-12-22 9:00:00,,,,,,,,,,,,,,,,,,""
2020-12-23 9:00:00,,,,,,,,,,,,,,,,,,""
2021-01-01 9:00:00,,,,,,,,,,,,,,,,2.5,,""
2021-01-02 9:00:00,1.0,,,,,,,,,,,,,,,5,,""
2021-01-03 9:00:00,1.0,,,,,,,,,,,,,,,7,,""
2021-01-04 9:00:00,2.0,,,,,,,,,,,,,,,8,,""
2021-01-08 9:00:00,1.0,,,,,1,,,,,,,,,,8,,"Audiogram confirms"
2021-01-09 9:00:00,1.0,,,,,1,,,,,,,,,,8,,""
2021-01-12 9:00:00,1.0,,,,,1,,,,,,,,,,8,,""
2021-01-20 9:00:00,1.0,,,,,1,,,,,,,,,,6,,""
2021-01-24 9:00:00,1.0,,,,,1,,,,,,,,,,5,,""
2021-01-25 9:00:00,1.5,,,,,,,,,,,,,,,6,,""
2021-01-26 9:00:00,1.5,,,,,,,,,,,,,,,4,,""
2021-01-27 6:15:00,2.5,,,,2,,,,,7,,,,,,4,,""
2021-01-29 6:15:00,2.5,,,,2,,,,,7,,,,,,4,,""
2021-02-02 7:00:00,1.5,,,,2,,,,,7,,,,,,4,,"Steroid shot"
2021-02-03 7:00:00,0.5,,,,,,,,,,,,,,,,,"Unbalanced"
2021-02-06 7:00:00,2.0,,,,,,,,,,,,,,,,,""
2021-02-07 7:00:00,1.0,,,,,,,,,,,,,,,,,""
2021-02-07 17:00:00,1.0,,,,,8,,,,,,,,,,,,""
2021-02-08 17:00:00,1.5,,,,,,,,,,,,,,,,,""
2021-02-15 7:00:00,1.5,,,,,,,,,,,5,5,5,5,4,,"Unbalanced"
2021-02-17 7:00:00,,,,,,,,,,7,,,,,,,,"Walking left bias"
2021-02-17 21:00:00,,,,,,,,,,,,,,,,,,"Unbalanced"
2021-02-18 21:00:00,,,,,,,,,,,,,,,,,,"Unbalanced"
2021-02-21 7:00:00,,,,,,,,,,,,5,5,0,0,,,"Starting migraine diet"
2021-02-22 7:00:00,,,,,,,,,,,,0,0,0,0,,5,"Somewhat unbalanced"
2021-02-22 7:00:00,0.5,,,,,,,,,,,,,,,,,""
2021-02-24 7:00:00,0.5,,,,,,,,,,,,,,,,,""
2021-03-01 7:00:00,0.5,,1,,2,,,,,,,,,,,,,""
2021-03-09 7:00:00,0.5,,1,,2,6,,,,,,,,,,,,""
2021-03-10 7:00:00,0.5,,0.5,,2,,,,,,,,,,,,,""
2021-03-10 17:45:00,0.5,1,0.5,,2,,,,,,,,,,,,,""
2021-03-11 7:22:00,1.0,,0.5,,2,,,,,,,3,3,3,3,,,"Somewhat unbalanced"
2021-03-13 7:00:00,1.0,,2.5,,2,,,,,,,5,5,5,5,,,"Somewhat unbalanced"
2021-03-14 7:00:00,2.0,,-2,,,,,,,,,,,,,,,""
2021-03-20 7:00:00,1.2,,,,,,,,,,,,,,,,,""
2021-03-21 7:00:00,,,,,,,,,,,,,,,,,,""
2021-04-12 7:00:00,0.5,1,-1,,,,,,,,,,,,,,,""
2021-04-12 7:00:00,0.5,1,0.5,,,,,,,,,,,,,,,""
2021-04-14 7:00:00,0.5,1,2.5,,,,,,,,,,,,,,,""
2021-06-16 7:00:00,,1,,,,,,,,,,,,,,,,""
2021-06-17 7:00:00,0.2,,2,,,,,,,,,,,,,,,""
2021-07-30 7:00:00,,,,1,,,,,,,,,,,,,,""
2021-08-02 7:00:00,,,3.5,,2,8,,,,,,,,,,,,""
2021-08-03 7:00:00,,1.5,,,,,,,,,,,,,,,,""
2021-08-04 7:00:00,,2,,,,,,,,,,,,,,,,""
2021-08-04 19:00:00,0.8,2,1,,,,,,,,,,,,,,,"Unbalanced"
2021-08-04 21:00:00,1.0,2.5,1,,,,,,,,,,,,,,,""
2021-08-04 22:00:00,1.2,3,1,,,,,,,,,2,2,2,2,,,""
2021-08-04 23:00:00,2.0,,1,,,,,,,0,0,4,4,4,4,,,"Made VNG video at home"
2021-08-06 7:00:00,2.5,,,,,1,,,,,,,,,,,,""
2021-08-07 7:00:00,,,,,,,,,,,,,,,,,,""
2021-08-22 7:00:00,0.5,,1.5,,,8,,,,,,,,,,,,""
2021-08-24 7:00:00,1.0,,1.5,,,1,,,,,,,,,,,,""
2021-08-24 7:00:00,1.5,,0.5,,,1,,,,,,4,4,4,4,,,""
2021-08-25 7:00:00,,,,,,,,,,,,,,,,,,""
2021-10-01 7:00:00,0.5,1,,,,,,,,,,,,,,,,""
2021-10-04 7:00:00,0.7,2,,,,,,,,,,,,,,,,""
2021-10-10 22:00:00,1.7,2,,,,,,,,,,,,,,,,""
2021-10-11 22:00:00,,,,,,,,,,,,,,,,,,""
2021-10-22 7:00:00,0.5,,,,,4,,,,,,,,,,,,"Somewhat unbalanced"
2021-10-23 7:00:00,0.7,2,,,,,,,,,,2,2,2,2,,,""
2021-10-24 7:00:00,0.3,0,,,,,,,,,,0,0,0,0,,,"Expected episode but feel better"
2021-11-03 7:00:00,0.6,0,,,,4,,,,,,,,,,,,""
2021-11-06 18:00:00,0.4,0,,,,4,,,7,,,,,,,,,""
2021-11-06 22:45:00,3.0,3,,,,4,,,,,,,,,,,,"Sudden onset nystagmus 1-2 mins"
2021-11-07 22:45:00,0.7,0,,,,4,,,,,,,,,,,,"Expected episode but feel better"
2021-11-08 7:00:00,,,,,,,,,,,,,,,,,,""
2022-02-09 07:00:00,0.4,2,,,,1,,,,,,,,,,,,"Underfed"
2022-02-11 07:00:00,2.0,,,,,,,,,0,0,,,,,,,""
2022-02-13 07:00:00,0.4,,,,,1,,,,,,,,,,,,""
2022-02-28 07:00:00,0.4,,,,,8,,,,,,,,,,,,""
2022-03-01 07:00:00,0.4,,,,,6,,,,,,,,,,,,""
2022-03-02 07:00:00,0.4,,,,,6,,,,,,,,,,,,""
2022-03-04 07:00:00,0.7,1,,,,1,,,,,,,,,,,,""
2022-03-05 07:00:00,1.3,3,,,,,,,,,,,,,,,,""
2022-03-06 07:00:00,1.7,,,,,1,,,,,,0,0,0,0,,,"Unbalanced"
2022-03-07 04:00:00,1.3,,,,,1,,,,,,,,,,,,"Up early for a flight"
2022-03-09 07:00:00,1.4,,,,,1,,,,,,,,,,,,"Nystagmus while lying down, persistent"
2022-04-01 07:00:00,0.7,,,,,,,,,,,,,,,,,"Mostly better"
2022-04-04 07:00:00,0.6,,,,,,,,,,,,,,,,,"Positional nystagmus"
2022-04-05 07:00:00,,,,,,,,,,,,,,,,,,""
2022-04-22 07:00:00,0.6,1,,,,8,,,,,,,,,,,,""
2022-04-23 07:00:00,0.7,1,,,,8,,,,,,,,,,,,""
2022-04-24 07:00:00,0.8,2,,,,8,,,,,,,,,,,,""
2022-04-25 07:00:00,1.7,,,,,5,,,,,,0,0,0,0,,,""
2022-04-26 07:00:00,1.5,,,,,5,,,,,,,,,,,,""
2022-04-27 07:00:00,1.5,,,,,5,,,,,,,,,,,3,""
2022-04-28 07:00:00,1.4,,,,,5,,,,,,0,0,3,0,,3,""
2022-04-29 07:00:00,1.3,,,,,2,,,,,,0,0,2,0,,4,""
2022-04-30 07:00:00,,,,,,,,,,,,,,,,,,""
2022-05-05 07:00:00,0.4,,,,,,,,,,,,,,,,,""
2022-05-06 07:00:00,,,,,,,,,,,,,,,,,,""
2022-06-01 07:00:00,0.5,,,,,,,,,,,,,,,,,""
2022-06-02 17:10:00,0.7,2,,,,,,,,,,,,,,,,"Somewhat unbalanced"
2022-06-03 17:10:00,0.7,2,,,,8,,,,,,,,,,,,"Vertigo is pretty much gone"
2022-06-04 17:10:00,,,,,,,,,,,,,,,,,,""
2022-06-11 17:10:00,0.7,2,,,,5,,,,,,,,,,,,""
2022-06-12 7:10:00,,,,,,,,,,,,,,,,,,""
2022-08-03 07:00:00,0.5,2,,,,,,,,,,,,,,,,""
2022-08-04 07:00:00,0.5,2,,,,,,,,,,,,,,,,""
2022-08-05 07:00:00,1.5,,,,,,,,,,,,,,,,,""
2022-08-06 07:00:00,3.0,,,,,,,,,,,,,,,,,""
2022-08-07 07:00:00,2.0,,,,,,,,,,,,,,,3,3,""
2022-08-08 07:00:00,1.5,,,,,,,,,,,,,,,1,5,""
2022-08-08 18:00:00,1.3,,,,,,,,,,,,,5,5,,5,""
2022-08-09 18:00:00,,,,,,,,,,,,,,,,,,""
2023-01-20 7:00:00,0.1,2,1.5,0.1,0.0,2,2,4,4,,1,1,1,1,1,0,0,""
2023-01-21 7:00:00,0.2,2,1.5,0.1,0.0,2,2,4,4,,1,1,1,1,1,0,0,""
2023-01-23 7:00:00,0.2,4,1.5,0.1,0.0,2,2,4,4,,1,1,1,1,1,0,0,""
2023-01-24 7:00:00,0.5,0,0.5,0.1,0.0,2,2,4,4,5,1,1,1,1,1,0,0,""
2023-01-24 13:00:00,1.5,,0.5,0.1,0.0,2,2,4,4,,1,1,1,1,1,0,1,""
2023-01-25 7:00:00,2.0,,0.5,0.1,0.0,2,2,4,4,,1,1,1,1,1,0,1,""
2023-01-26 7:00:00,1.5,,0,0,0.0,1,0,4,4,,1,1,1,1,1,0,2,""
2023-01-26 12:31:00,1.5,,,,,1,0,4,4,,1,1,1,5,1,0,3,""
2023-01-27 07:00:00,0.4,0,,,,,,,,,,,,,,,,""
2023-01-29 7:00:00,0.9,0,1.0,0.2,0.0,1,0.5,4,4,3,0,1,1,4,1,0,3,""
2023-01-30 7:00:00,0.8,0,1.0,0.2,0.0,1,0.5,4,4,3,0,1,1,4,1,0,3,""
2023-01-31 7:00:00,0.8,0,0,0.2,0.0,1,0.1,4,4,3,0,1,1,4,1,0,3,""
2023-02-13 07:00:00,,,,,,,,,,,,,,,,,,"Ping goes to Miami conference"
2023-02-14 07:00:00,0.2,0,,,,,,,,0.5,0.5,0,0,0,0,0,1,"First Cascade Dizziness visit"
2023-02-16 07:00:00,0.2,0,1,2,2,1,0,2,4,,,0,0,0,0,0,1,"Start getting bad cold (102 fever)."
2023-02-17 07:00:00,0.2,0,1,2,3,1,0,2,4,,,0,0,0,0,0,1,"Start getting bad cold (102 fever)"
2023-02-21 07:48:04,0.2,2,-1,0,0,1,0,1,3,0.1,0.1,0,0,1,0,0,0,"First day after bad cold"
2023-02-22 07:48:04,0.2,2,2,0,0,1,0,1,3,0.1,0.1,0,0,1,0,0,0,""
2023-03-21 07:00:00,,,,,,,,,,,,,,,,,,""
2023-03-21 20:29:08,0.1,2,3,2,0,3,1,4,2,1.5,1.5,0,0,0.5,0,0,0,"Strong dizzy spell after stressful time putting Ellie to bed. 30 seconds. Did Semont maneuver, mild response"
2023-03-22 18:00:00,0.2,3,2,0.1,0.1,3,0,4,2, ,8,0,0,0.5,0,0,0,"BPPV bout while seaching for kids toy under bed"
2023-03-23 05:30:00,0.2,3,2,0.1,0.1,3,0,4,2, ,8,0,0,0.5,0,0,0,"While waking up (not rolling over), strong BPPV bout lasting 30 seconds. Came back strongly for 30 when I turned my head to the left on pillow"
2023-03-23 06:00:00,0.2,3,2,0.1,0.1,3,0,4,2, ,8,0,0,0.5,0,0,0,"Performed Epley for right ear. Extremely strong BPPV during phases 1, 2. Medium during phase 3."
2023-04-08 07:00:00,0, , , , , , , , , , , , , , , , ,""
2023-04-09 07:00:00,0,2, , , , , , , , , , , , , , , ,""
2023-04-10 07:00:00,0,2, , , , , , , , , , , , , , , ,""
2023-04-11 07:00:00,2,0, , , , , , , , , , , , , , , ,""
2023-04-12 07:00:00,4,0, , , , , , , , , , , , , , , ,"Recorded eye movements. Strong nystagmus from tilting head down."
2023-04-13 07:00:00,3,0, , , , , , , , , , , , , , , ,"Cascade appointment - Julie says downward tilt isn't a normal trigger."
2023-04-14 07:00:00,4,0, , , , , , , , , , , , , , , ,""
2023-04-15 07:00:00,1.5,0, , , , , , , , , , , , , , , ,""
2023-04-16 07:00:00,1.5,0, , , ,1, , , , , , , , , , , ,"Bouts of spotnateous strong nystagmus in bed"
2023-04-17 07:00:00,1.5,0, , , ,1, , , , , , , , , , , ,"Bouts of spotnateous strong nystagmus in bed"
2023-04-18 07:00:00,1.5,0, , , ,9, , , , , , , , , , , ,"Stressful news from Ping? (not sure about the date)"
2023-04-19 07:00:00,1.5,0, , , ,9, , , , , , , , , , , ,"Nystagmus when lying on right ear"
2023-04-20 07:00:00,2,0, , , ,9, , , , , , , , , , , ,""
2023-05-01 07:00:00,1,0, , , ,9, , , , , , , , , , , ,"Julie recommends full vestibular test batery at UW"
2023-05-03 07:00:00,0.5,0, , , ,9, , , , , , , , , , , ,""
2023-05-04 07:00:00,0,0, , , ,, , , , , , , , , , , ,""
2023-05-20 07:00:00,0,0, , , ,, , , , , , , , , , , ,""
2023-05-21 07:00:00,0.5,0, , , ,9, , , , , , , , , , , ,""
2023-05-22 07:00:00,0.5,0, , , ,6, , , , , , , , , , , ,"Company offsite starts"
2023-05-24 07:00:00,0.5,1, , , ,6, , , , , , , , , , , ,"Feels like roof is swaying a little"
2023-05-26 07:00:00,0.5,2, , , ,6, , , , , , , , , , , ,"Company offsite ends. Swaying feeling on ground floor"
2023-05-27 07:00:00,1,2, , , ,7, , , , , , , , , , , ,"Back to Seattle"
2023-05-27 22:00:00,1.5,2, , , ,9, , , , , , , , , , , ,"minor nystagmus on pillow at night"
2023-05-28 07:00:00,1.5,2, , , ,9, , , , , , , , , , , ,"Minor baseline vertigo discomfort"
2023-05-28 16:00:00,2.0, , , , , , , , , , , , , , , , ,"Indigo UngentCare re: airplane ear. Prescribed antibiotics, flonaze, meclazine. Didn't take meclazine."
2023-05-29 09:18:48,2.5,0,0,1,0,4,0,3,2,1,1,0.5,1,0.5,0.5,3,0,"Weird acceleration feeligs, but not clearly UL/UR. Day2 of antibiotics"
2023-05-29 22:30:00,2.5, ,,,,,,,,,,,,,,,,"Laying down did not cause veritgo. Right side-lying caused very persistent, slow nystagmus"
2023-05-30 07:06:04,2.5, ,0,1,0,4,0,2,2,0.5,0.5,1,2,3,4,7,1,"Linear accelerations feel wrong"
2023-06-02 18:25:49,1.5,0,0,0,1,3,0,2,3,0.5,0,0.5,1,3,0,4,3,"Head turn to the right has too much acceleration"
2023-06-03 10:41:43,1.2, ,1.5, , ,3,0,2,2, , ,0,1,2,0.5,5,5,"Turn to the right accelerates too fast. Right tinnitus"
2023-06-04 18:00:00,1.2, ,2,2,0.5,3,3,4,2,4,5,1,1,1,1,2,4,"Strong D/H, performed epley on both left and right"
2023-06-04 22:50:54,1.2, , ,2,1,3,4,3,2,3,0, , , , , , ,"After doing epley on both sides, D/H on right side is totally negative"
2023-06-11 18:28:30,1.0,1,1.5,4,0,5,2,4,1, , ,0.2,0.1,0.1,0.1,4,3,"Returning from Skamacowa today"
2023-06-12 18:30:32,0.9,0.5,1,4,3,3,0,2,3, , , , , , , , ,""
2023-06-15 07:00:00,0.2,0,0,0,0,0,0,0,0, , , , , , , , ,"Made up data - retrospectively I think vertigo ended here"
2023-07-07 07:00:00,0.1,2, , , ,, , , , , , , , , , , ,""
2023-07-08 07:00:00,0.2,2,1, , ,, , , , , , , , , , , ,""
2023-07-09 07:00:00,0.5,2,2, , ,, , , , , , , , , , , ,""
2023-07-10 07:00:00,1.0,3,1 , , ,, , , , , , , , , , , ,""
2023-07-12 07:00:00,0.6,2,1 , , ,, , , , , , , , , , , ,""
2023-07-13 07:00:00,0.2,2,0 , , ,, , , , , , , , , , , ,"Inflection point - finally back to normal"
2023-07-24 19:38:37,0.3,1,3,1,0,1,0,1,2,0.1,0.1,0.5,0.1,0.4,0.1,3,0,"Still uncomfortable laying down"
2023-08-05 07:00:00,0.3,1,2, , ,2,1,2,2, , , , , , ,0,0,""
2023-08-06 22:06:31,0.5,3,0.5,0,0,1,1,2,3,0,1.0,2,0.5,2.5,0.5,0,0,"1 drink yesterday"
2023-08-08 07:35:10,1.1,0,0.5,0,0,1,0,1,3, , ,0.4,0.1,2.0,0.1,0,0,"Feels like day 2 of episode"
2023-08-09 07:35:10,1.4,0,0.5,0,0,1,0,1,3, , ,0.8,0.1,2.0,0.1,0,0,"Constant low-medium nystagmus while lying down"
2023-08-12 23:25:45,1.5,0,1,0,0,1,2,2,2, , ,2,2.5,1,1,5,0,"The too-fast-acceleration has changed sides. Tinnitus starting in left ear. Hearing loss in AM, tinnitus in PM."
2023-08-18 09:21:37,1.0,0,1,0,3,1.5,1,3,3,0.5,0.5,0.5,0.5,0.5,0.5,3,0,"BPPV in bed, but no clear dix-hallpike"
2023-09-04 17:00:00,1.0,0,1,0,3,1.5,1,3,3,0.5,0.5,0.5,0.5,0.5,0.5,3,0,"BPPV in bed, but no clear dix-hallpike"
2023-09-04 17:30:00,1.0,0,1,0,3,7,1,3,3,0.5,0.5,0.5,0.5,0.5,0.5,3,0,"Huge stress spike about laptop"
2023-09-04 18:00:00,1.0,0,1,0,3,1.5,1,3,3,0.5,0.5,0.5,0.5,0.5,0.5,3,0,"BPPV in bed, but no clear dix-hallpike"
2023-09-08 09:30:00,1.0,0,1,0,3,3,1,3,3,0.5,0.5,0.5,0.5,0.5,0.5,1,0,"BPPV in bed, but no clear dix-hallpike. One episode of extreme 'falling' feeling for 0.25 seconds"
2023-09-14 09:30:00,1.0,0,1,0,3,3,1,3,3,0.5,0.5,0.5,0.5,0.5,0.5,1,0,"BPPV in bed"
2023-09-15 09:30:00,1.1,0,1,0,3,3,1,3,3,0.5,0.5,0.5,0.5,0.5,0.5,1,0,"BPPV in bed"
2023-09-17 09:30:00,1.2,0,1,0,3,3,1,3,3,0.5,0.5,0.5,0.5,0.5,0.5,1,0,"BPPV in bed"
2023-09-19 09:30:00,1.4,0,1,0,3,3,1,3,3,0.5,0.5,0.5,0.5,0.5,0.5,1,0,"BPPV in bed"
2023-09-20 09:30:00,1.5,0,1,0,3,3,1,3,3,0.5,0.5,0.5,0.5,0.5,0.5,2,0,"Day 1 of anti-migraine meds"
2023-09-21 09:30:00,1.1,0,1,0,3,3,1,3,3,0.5,0.5,0.5,0.5,0.5,0.5,3,0,"Great sleep last night (10 hrs)"
2023-09-21 09:30:00,2.5,0,1,0,3,3,1,3,3,0.5,0.5,0.5,0.5,0.5,0.5,4,0,"Lots of vertigo, feel bad. Right-beat nystagmus after head-shake test. Left tinitus and hearing loss."
2023-09-23 09:30:00,2.2,0,0,1,1,5,0,2,2,0.5,0.5,0.5,0.5,0.5,0.5,3,4,"Lots of sleep last night. Left ear tinnitus. Depressed. RV camping day 1. Right head turns: eyes don't track."
2023-09-24 09:30:00,2.0,0,0,1,1,5,0,2,2,0.5,0.5,0.5,0.5,0.5,0.5,3,4,"Lots of sleep. Left ear tinnitus. Depressed. RV camping day 2 (zoo). Right head turns: eyes don't track."
2023-09-25 09:30:00,1.5,0,0,1,1,2,0,2,2,0.5,0.5,0.5,0.5,0.5,0.5,3,4,"Lots of sleep. Left tinitus constant low frequency. High freq modulated by which sided own on pillow. Head turn to the right is uncomfortably 'fast' and eyes don't track."
2023-09-26 09:30:00,0.5,0,0,1,1,2,0,2,2,0.5,0.5,0.5,0.5,0.5,0.5,3,4,"Lots of sleep. Early evening stright right ear tinitus lying on right side, left lying on left side. By midnight, just right side. Head shake test: feels back to normal."
2023-10-16 07:30:00,0.5,0,0,1,1,2,0,2,2,0.5,0.5,0.5,0.5,0.5,0.5,1,1,"Headache - needed Advil"
2023-10-18 07:30:00,0.5,0,0,1,1,4,0,2,2,0.5,0.5,0.5,0.5,0.5,0.5,1,1,"Stress at work - webauthn complaints"
2023-10-19 07:30:00,0.5,0,0,1,1,5,0,2,2,0.5,0.5,0.5,0.5,0.5,0.5,1,1,"Stress at work - webauthn complaints"
2023-10-21 07:30:00,0.5,0,0,1,1,2,0,2,2,0.5,0.5,0.5,0.5,0.5,0.5,1,1,"Lots of sleep. Some vertigo while lying on right ear."
2023-10-22 07:30:00,0.5,1,0,1,1,2,0,2,2,0.5,0.5,0.5,0.5,0.5,0.5,1,1,"Lots of sleep. Some vertigo while lying on left/right ear. Tiny hint of vertigo?"
2023-10-26 07:30:00,0.5,0,0,1,1,2,0,2,2,0.5,0.5,0.5,0.5,0.5,0.5,1,1,"Lots of sleep. Some vertigo while lying on left/right ear"
2023-10-26 08:30:00,0.5,0,0,1,1,8,0,2,2,0.5,0.5,0.5,0.5,0.5,0.5,1,1,"Massive stress spike. Felt very bad most of the day."
2023-10-28 07:30:00,0.5,0,0,1,1,3,0,2,2,0.5,0.5,0.5,0.5,0.5,0.5,1,1,"Stress subsiding"
2023-12-25 02:00:00,0.1,3,-2,3,0,5,0,2,3,1,1.00,0.1,0.1,0.1,0.1,0,0,"Strong BPPV in the night, worried about another episode, but none came."
2024-01-22 07:00:00,0.1,0,1.5,0,0,1,0,1,4,0,0,0,0,1,0,0,0,"Staying up a little late"
2024-01-23 07:00:00,0.1,0,1.5,0,0,1,0,1,4,0,0,0,0,1,0,0,0,"Staying up a little late"
2024-01-24 07:00:00,0.1,0,1.5,0,0,1,0,1,4,0,0,0,0,1,0,0,0,"Staying up a little late. Ate some walnut brownie."
2024-01-25 19:00:00,0.6,2,1.5,0,0,1,0,1,4,0,0,0,0,1,0,0,0,"Big stress from car title, work, Staying up a little late. Feels vertigoy at night looking at monitor. House inspection goes bad for 347, no permits on kitchen."
2024-01-27 07:00:00,0.8,0,0,0,0,3,0,2,2,1,4,1,0,2,0,3,0,"Feel a little bad. One pulse of BPPV when turning to the right in bed. Positional tinnitus."
2024-01-28 07:00:00,0.9,0,0.5,0,0,3,0,2,2,1,4,1,0,2,0,4,0,"Feel a little worse. Some acceleration for up/down, rather than diagonal."
2024-01-29 07:00:00,0.6,0,0  , , , , , , , , , , , , , , ,"Returning to normal"
2024-01-30 07:00:00,0.6,0,0  , , , , , , , , , , , , ,5,0,"UW Audiology appointment finds strong hearing loss in left ear."
2024-02-08 07:00:00,0.4,2,0.5,1,1,3,,,,,,,,,,0,0,"Nystagmust looking down-left. About to get sick (head cold). Stressed over Ping and work."
2024-02-11 07:00:00,0.6,2,0.5,3,3,4,,,,,,,,,,0,0,"Day after peak sick. Feels like subtle oscillopsia."